Target
Botulinum neurotoxin type F
Ligand
BDBM91557
Substrate
Meas. Tech.
High-throughput multiplex microsphere dose response for inhibitors of toxin protease, specifically Botulinum neurotoxin light chain F protease, compounds from Powder Set 01
EC50
>20000±n/a nM
Citation
 PubChem, PC High-throughput multiplex microsphere dose response for inhibitors of toxin protease, specifically Botulinum neurotoxin light chain F protease, compounds from Powder Set 01 PubChem Bioassay (2012)[AID] 
Target
Name:
Botulinum neurotoxin type F
Synonyms:
BXF_CLOBO botulinum neurotoxin type F, BoNT/F
Type:
Enzyme Catalytic Domain
Mol. Mass.:
146691.56
Organism:
Clostridium botulinum Bf
Description:
P30996
Residue:
1274
  
Inhibitor
Name:
BDBM91557
Synonyms:
1,3,5-triphenylpyrazole cid_626614
Type:
Small organic molecule
Emp. Form.:
C21H16N2
Mol. Mass.:
296.3651
SMILES:
c1c(nn(c1-c1ccccc1)-c1ccccc1)-c1ccccc1
: