Target
Acetylcholine-binding protein
Ligand
BDBM50088437
Substrate
Meas. Tech.
Radioligand Competition Assay
Ki
8.9±0.9 nM
Citation
 Rohde, LAAhring, PKJensen, MLNielsen, EØPeters, DHelgstrand, CKrintel, CHarpsøe, KGajhede, MKastrup, JSBalle, T Intersubunit bridge formation governs agonist efficacy at nicotinic acetylcholine α4β2 receptors: unique role of halogen bonding revealed. J Biol Chem 287:4248-59 (2012)  
Target
Name:
Acetylcholine-binding protein
Synonyms:
ACHP_LYMST Acetylcholine Binding protein Acetylcholine-binding protein (Ls-AchBP) | AchBP
Type:
Mol. Mass.:
26055.52
Organism:
Lymnaea stagnalis
Description:
Soluble acetylcholine receptor
Residue:
229
  
Inhibitor
Name:
BDBM50088437
Synonyms:
1-(5-Phenyl-pyridin-3-yl)-[1,4]diazepane NS3570, 3
Type:
Small organic molecule
Emp. Form.:
C16H19N3
Mol. Mass.:
253.3422
SMILES:
C1CNCCN(C1)c1cncc(c1)-c1ccccc1
: