Target
Macrophage metalloelastase
Ligand
BDBM92443
Substrate
Meas. Tech.
Enzyme Assay
pH
6.8±0
Temperature
298.15±0 K
Ki
1.9±0.0 nM
Citation
 Devel, LBeau, FAmoura, MVera, LCassar-Lajeunesse, EGarcia, SCzarny, BStura, EADive, V Simple Pseudo-dipeptides with a P2' Glutamate: A NOVEL INHIBITOR FAMILY OF MATRIX METALLOPROTEASES AND OTHER METZINCINS. J Biol Chem 287:26647-56 (2012)  
Target
Name:
Macrophage metalloelastase
Synonyms:
HME MMP12_HUMAN Matrix metalloproteinase-12 (MMP 12) Matrix metalloproteinase-12 (MMP12) | Matrix metalloproteinases 12 (MMP-12)
Type:
Enzyme
Mol. Mass.:
54012.99
Organism:
Homo sapiens (Human)
Description:
P39900
Residue:
470
  
Inhibitor
Name:
BDBM92443
Synonyms:
MMP Inhibitor, 3 US8691753, 97
Type:
Small molecule
Emp. Form.:
C29H31N3O7S
Mol. Mass.:
565.637
SMILES:
NC(=O)[C@@H](CCC(O)=O)NC(=O)[C@H](CCC(O)=O)NC(=O)CCc1ccc(cc1)-c1cc(cs1)-c1ccccc1
: