Target
Collagenase 3
Ligand
BDBM92449
Substrate
Meas. Tech.
Enzyme Assay
pH
6.8±0
Temperature
298.15±0 K
Ki
468±0.0 nM
Citation
 Devel, LBeau, FAmoura, MVera, LCassar-Lajeunesse, EGarcia, SCzarny, BStura, EADive, V Simple Pseudo-dipeptides with a P2' Glutamate: A NOVEL INHIBITOR FAMILY OF MATRIX METALLOPROTEASES AND OTHER METZINCINS. J Biol Chem 287:26647-56 (2012)  
Target
Name:
Collagenase 3
Synonyms:
MMP-13 MMP13_HUMAN Matrix metalloproteinase-13 (MMP-13) | Matrix metalloproteinase-13 (MMP13)
Type:
Enzyme
Mol. Mass.:
53808.06
Organism:
Homo sapiens (Human)
Description:
P45452
Residue:
471
  
Inhibitor
Name:
BDBM92449
Synonyms:
Inhibitor, 19
Type:
Small organic molecule
Emp. Form.:
C24H24N2O4S
Mol. Mass.:
436.523
SMILES:
NC(=O)[C@H](CCC(O)=O)NC(=O)CCc1ccc(cc1)-c1ccc(s1)-c1ccccc1
: