Target
Calcium/calmodulin-dependent protein kinase kinase 2
Ligand
BDBM92455
Substrate
Meas. Tech.
Kinase Assay
pH
7.5±0
Temperature
303.15±0 K
IC50
5.0e+2±n/a nM
Citation
 Kukimoto-Niino, MYoshikawa, STakagi, TOhsawa, NTomabechi, YTerada, TShirouzu, MSuzuki, ALee, SYamauchi, TOkada-Iwabu, MIwabu, MKadowaki, TMinokoshi, YYokoyama, S Crystal structure of the Ca2+/calmodulin-dependent protein kinase kinase in complex with the inhibitor STO-609. J Biol Chem 286:22570-9 (2011)  
Target
Name:
Calcium/calmodulin-dependent protein kinase kinase 2
Synonyms:
CAMKK2 Calcium/calmodulin-dependent protein kinase kinase 2 (CaMKKB) KIAA0787 | KKCC2_HUMAN
Type:
Enzyme Catalytic Domain
Mol. Mass.:
64746.61
Organism:
Homo sapiens (Human)
Description:
gi_27437015
Residue:
588
  
Inhibitor
Name:
BDBM92455
Synonyms:
CHEMBL265470 | STO-609
Type:
Small organic molecule
Emp. Form.:
C19H10N2O3
Mol. Mass.:
314.2943
SMILES:
OC(=O)c1ccc2c3nc4ccccc4n3c(=O)c3cccc1c23
: