Target
Alpha-(1,3)-fucosyltransferase 7
Ligand
BDBM50187132
Substrate
Meas. Tech.
SPA Assay
pH
7.3±0
Temperature
295.15±0 K
IC50
>200000±0.0 nM
Citation
 Niu, XFan, XSun, JTing, PNarula, SLundell, D Inhibition of fucosyltransferase VII by gallic acid and its derivatives. Arch Biochem Biophys 425:51-7 (2004)  
Target
Name:
Alpha-(1,3)-fucosyltransferase 7
Synonyms:
Alpha-(1,3)-fucosyltransferase VII FUT7_HUMAN Fuct VII
Type:
Mol. Mass.:
39259.56
Organism:
Homo sapiens (Human)
Description:
Q11130
Residue:
342
  
Inhibitor
Name:
BDBM50187132
Synonyms:
3,5-Dimethoxy-4-hydroxybenzoic acid CHEMBL1414 | Syringic acid
Type:
Small organic molecule
Emp. Form.:
C9H10O5
Mol. Mass.:
198.1727
SMILES:
COc1cc(cc(OC)c1O)C(O)=O
: