Target
72 kDa type IV collagenase
Ligand
BDBM92459
Substrate
Meas. Tech.
SPA Assay
pH
7.5±0
Temperature
295.15±0 K
IC50
>200000±0 nM
Citation
 Niu, XFan, XSun, JTing, PNarula, SLundell, D Inhibition of fucosyltransferase VII by gallic acid and its derivatives. Arch Biochem Biophys 425:51-7 (2004)  
Target
Name:
72 kDa type IV collagenase
Synonyms:
72 kDa gelatinase CLG4A Gelatinase A (MMP-2) MMP2_HUMAN Matrix metalloproteinase-2 (MMP 2) Matrix metalloproteinases 2 (MMP-2) | TBE-1
Type:
Enzyme
Mol. Mass.:
73870.36
Organism:
Homo sapiens (Human)
Description:
P08253
Residue:
660
  
Inhibitor
Name:
BDBM92459
Synonyms:
CHEMBL384759 Guanosine Diphosphate
Type:
Small molecule
Emp. Form.:
C10H15N5O11P2
Mol. Mass.:
443.2005
SMILES:
Nc1nc2n(cnc2c(=O)[nH]1)[C@@H]1O[C@H](COP(O)(=O)OP(O)(O)=O)[C@@H](O)[C@H]1O
: