Target
Plasminogen activator inhibitor 1
Ligand
BDBM92480
Substrate
Meas. Tech.
Enzymatic Assay
pH
7.8±0
Temperature
296.15±0 K
IC50
3.3e+2± 6e+1 nM
Citation
 Cale, JMLi, SHWarnock, MSu, EJNorth, PRSanders, KLPuscau, MMEmal, CDLawrence, DA Characterization of a novel class of polyphenolic inhibitors of plasminogen activator inhibitor-1. J Biol Chem 285:7892-902 (2010)  
Target
Name:
Plasminogen activator inhibitor 1
Synonyms:
Endothelial plasminogen activator inhibitor PAI-1 PAI1_HUMAN Plasminogen activator inhibitor 1 Plasminogen activator inhibitor-1 SERPINE1
Type:
Enzyme
Mol. Mass.:
45064.00
Organism:
Homo sapiens (Human)
Description:
P05121
Residue:
402
  
Inhibitor
Name:
BDBM92480
Synonyms:
Epigallocatechin-3,5-Digallate, C
Type:
Small organic molecule
Emp. Form.:
C29H22O15
Mol. Mass.:
610.476
SMILES:
Oc1cc(OC(=O)c2cc(O)c(O)c(O)c2)c2C[C@@H](OC(=O)c3cc(O)c(O)c(O)c3)[C@H](Oc2c1)c1cc(O)c(O)c(O)c1
: