Target
Cytochrome P450 144
Ligand
BDBM31772
Substrate
Meas. Tech.
Binding Assay
Kd
9.8e+2± 2.2e+2 nM
Citation
 Driscoll, MDMcLean, KJLevy, CMast, NPikuleva, IALafite, PRigby, SELeys, DMunro, AW Structural and biochemical characterization of Mycobacterium tuberculosis CYP142: evidence for multiple cholesterol 27-hydroxylase activities in a human pathogen. J Biol Chem 285:38270-82 (2010)  
Target
Name:
Cytochrome P450 144
Synonyms:
CP144_MYCTO cyp144
Type:
Enzyme
Mol. Mass.:
47207.78
Organism:
Mycobacterium tuberculosis
Description:
P9WPL0
Residue:
434
  
Inhibitor
Name:
BDBM31772
Synonyms:
1-[2-(2,4-dichlorobenzyl)oxy-2-(2,4-dichlorophenyl)ethyl]imidazole;nitric acid CHEMBL91 Miconazole US9144538, Miconazole Nitrate | cid_4189
Type:
Small organic molecule
Emp. Form.:
C18H14Cl4N2O
Mol. Mass.:
416.129
SMILES:
Clc1ccc(COC(Cn2ccnc2)c2ccc(Cl)cc2Cl)c(Cl)c1
: