Target
cAMP-dependent protein kinase catalytic subunit alpha
Ligand
BDBM92607
Substrate
Meas. Tech.
Enzyme Assay
Temperature
303.15±0 K
Ki
3.6e+2± 8e+1 nM
Citation
 Chijiwa, TMishima, AHagiwara, MSano, MHayashi, KInoue, TNaito, KToshioka, THidaka, H Inhibition of forskolin-induced neurite outgrowth and protein phosphorylation by a newly synthesized selective inhibitor of cyclic AMP-dependent protein kinase, N-[2-(p-bromocinnamylamino)ethyl]-5-isoquinolinesulfonamide (H-89), of PC12D pheochromocytoma cells. J Biol Chem 265:5267-72 (1990) Target
Name:
cAMP-dependent protein kinase catalytic subunit alpha
Synonyms:
KAPCA_HUMAN PKACA cAMP-dependent protein kinase (PKA) cAMP-dependent protein kinase catalytic subunit alpha cAMP-dependent protein kinase catalytic subunit alpha (PKACA) cAMP-dependent protein kinase catalytic subunit alpha isoform 1 | cAMP-dependent protein kinase, alpha-catalytic subunit
Type:
Enzyme Catalytic Subunit
Mol. Mass.:
40598.73
Organism:
Homo sapiens (Human)
Description:
Residue:
351
  
Inhibitor
Name:
BDBM92607
Synonyms:
H-88
Type:
Small Molecule
Emp. Form.:
C20H21N3O2S
Mol. Mass.:
367.465
SMILES:
O=S(=O)(NCCNC\C=C\c1ccccc1)c1cccc2cnccc12
: