Target
cAMP-dependent protein kinase catalytic subunit alpha
Ligand
BDBM19459
Substrate
Meas. Tech.
Kinase Assay
IC50
>1.00e+5±n/a nM
Citation
 Geissler, JFTraxler, PRegenass, UMurray, BJRoesel, JLMeyer, TMcGlynn, EStorni, ALydon, NB Thiazolidine-diones. Biochemical and biological activity of a novel class of tyrosine protein kinase inhibitors. J Biol Chem 265:22255-61 (1990) Target
Name:
cAMP-dependent protein kinase catalytic subunit alpha
Synonyms:
KAPCA_HUMAN PKACA cAMP-dependent protein kinase (PKA) cAMP-dependent protein kinase catalytic subunit alpha cAMP-dependent protein kinase catalytic subunit alpha (PKACA) cAMP-dependent protein kinase catalytic subunit alpha isoform 1 | cAMP-dependent protein kinase, alpha-catalytic subunit
Type:
Enzyme Catalytic Subunit
Mol. Mass.:
40598.73
Organism:
Homo sapiens (Human)
Description:
Residue:
351
  
Inhibitor
Name:
BDBM19459
Synonyms:
5,7-dihydroxy-3-(4-hydroxyphenyl)-4H-chromen-4-one Genistein Genisteol US8552057, 2 | cid_5280961
Type:
Phytoestrogen
Emp. Form.:
C15H10O5
Mol. Mass.:
270.2369
SMILES:
Oc1ccc(cc1)-c1coc2cc(O)cc(O)c2c1=O
: