Target
5-hydroxytryptamine receptor 3A
Ligand
BDBM221548
Substrate
Meas. Tech.
5HT3 In Vitro Assay
Temperature
310.15±n/a K
IC50
0.74±n/a nM
Comments
extracted
Citation
 Hitchcock, SMonenschein, HReichard, HSun, HKikuchi, SMacklin, THopkins, M 5-HT3 receptor antagonists US Patent  US9695195 Publication Date 7/4/2017 
Target
Name:
5-hydroxytryptamine receptor 3A
Synonyms:
5-HT-3 5-HT3A 5-hydroxytryptamine receptor 3 (5-HT3) 5-hydroxytryptamine receptor 3A (5HT3A) 5HT3R HTR3A Serotonin 3 receptor (5HT3) Serotonin-gated ion channel receptor | Serotonin-gated ion channel receptor 3
Type:
Protein
Mol. Mass.:
55283.27
Organism:
Homo sapiens (Human)
Description:
P46098
Residue:
478
  
Inhibitor
Name:
BDBM221548
Synonyms:
US9303045, 34 | US9695195, 34
Type:
Small organic molecule
Emp. Form.:
C19H23FN2O4S
Mol. Mass.:
394.46
SMILES:
CN1C2CCCC1CC(C2)OC(=O)c1cn(c2ccc(F)cc12)S(C)(=O)=O
: