Target
Acyl-protein thioesterase 1
Ligand
BDBM92722
Substrate
Meas. Tech.
Enzymatic Protein Activity Assay
IC50
3.2e+3± 2e+2 nM
Citation
 Zimmermann, TJBürger, MTashiro, EKondoh, YMartinez, NEGörmer, KRosin-Steiner, SShimizu, TOzaki, SMikoshiba, KWatanabe, NHall, DVetter, IROsada, HHedberg, CWaldmann, H Boron-based inhibitors of acyl protein thioesterases 1 and 2. Chembiochem 14:115-22 (2013)  
Target
Name:
Acyl-protein thioesterase 1
Synonyms:
APT-1 Acyl-protein thioesterase 1 (APT1 WT) LPL1 LYPLA1 Lysophospholipase 1 hAPT1
Type:
Protein
Mol. Mass.:
24670.33
Organism:
Homo sapiens (Human)
Description:
O75608
Residue:
230
  
Inhibitor
Name:
BDBM92722
Synonyms:
Phenylboronic acid, 15
Type:
Small molecule
Emp. Form.:
C12H10BIO3
Mol. Mass.:
339.921
SMILES:
OB(O)c1cc(Oc2ccccc2)ccc1I
: