Target
Acyl-protein thioesterase 1
Ligand
BDBM92726
Substrate
Meas. Tech.
Enzymatic Protein Activity Assay
IC50
6.3e+3± 5e+2 nM
Citation
 Zimmermann, TJBürger, MTashiro, EKondoh, YMartinez, NEGörmer, KRosin-Steiner, SShimizu, TOzaki, SMikoshiba, KWatanabe, NHall, DVetter, IROsada, HHedberg, CWaldmann, H Boron-based inhibitors of acyl protein thioesterases 1 and 2. Chembiochem 14:115-22 (2013)  
Target
Name:
Acyl-protein thioesterase 1
Synonyms:
APT-1 Acyl-protein thioesterase 1 (APT1 WT) LPL1 LYPLA1 Lysophospholipase 1 hAPT1
Type:
Protein
Mol. Mass.:
24670.33
Organism:
Homo sapiens (Human)
Description:
O75608
Residue:
230
  
Inhibitor
Name:
BDBM92726
Synonyms:
Phenylboronic acid, 19
Type:
Small molecule
Emp. Form.:
C7H8BBrO2
Mol. Mass.:
214.852
SMILES:
Cc1ccc(Br)c(c1)B(O)O
: