Target
Nociceptin receptor
Ligand
BDBM86253
Substrate
Ki
1000±n/a nM
Comments
PDSP_616
Citation
 Mogil, JSPasternak, GW The molecular and behavioral pharmacology of the orphanin FQ/nociceptin peptide and receptor family. Pharmacol Rev 53:381-415 (2001) Target
Name:
Nociceptin receptor
Synonyms:
K3 opiate receptor Kappa-type 3 opioid receptor Nociceptin/Orphanin FQ, NOP receptor ORGC Oprl Orphanin FQ receptor
Type:
Enzyme Catalytic Domain
Mol. Mass.:
40499.09
Organism:
MOUSE
Description:
Nociceptin/Orphanin FQ, NOP receptor 0 MOUSE::P35377
Residue:
367
  
Inhibitor
Name:
BDBM86253
Synonyms:
CAS_100929-53-1 NSC_104742 | US10836728, Compound DAMGO
Type:
Small organic molecule
Emp. Form.:
C26H35N5O6
Mol. Mass.:
513.586
SMILES:
CC(NC(=O)C(N)Cc1ccc(O)cc1)C(=O)NCC(=O)N(C)C(Cc1ccccc1)C(=O)NCCO
: