Target
Acetylcholine-binding protein
Ligand
BDBM92877
Substrate
Meas. Tech.
Interaction Assay
pH
7.4±0
Temperature
298.15±0 K
Kd
53.5±45 nM
Citation
 Geitmann, MRetra, Kde Kloe, GEHoman, ESmit, ABde Esch, IJDanielson, UH Interaction kinetic and structural dynamic analysis of ligand binding to acetylcholine-binding protein. Biochemistry 49:8143-54 (2010)  
Target
Name:
Acetylcholine-binding protein
Synonyms:
ACHP_LYMST Acetylcholine Binding protein Acetylcholine-binding protein (Ls-AchBP) | AchBP
Type:
Mol. Mass.:
26055.52
Organism:
Lymnaea stagnalis
Description:
Soluble acetylcholine receptor
Residue:
229
  
Inhibitor
Name:
BDBM92877
Synonyms:
Quinuclidine analogue, 4
Type:
Small molecule
Emp. Form.:
C20H22BrN3O
Mol. Mass.:
400.312
SMILES:
Brc1ccc(cc1)C(=O)N[C@@H]1C2CCN(CC2)C1Cc1cccnc1
: