Target
Oxaloacetate decarboxylase
Ligand
BDBM92964
Substrate
Meas. Tech.
Inhibition Assay
Ki
43000±2000 nM
Citation
 Narayanan, BCNiu, WHan, YZou, JMariano, PSDunaway-Mariano, DHerzberg, O Structure and function of PA4872 from Pseudomonas aeruginosa, a novel class of oxaloacetate decarboxylase from the PEP mutase/isocitrate lyase superfamily. Biochemistry 47:167-82 (2008)  
Target
Name:
Oxaloacetate decarboxylase
Synonyms:
OADC_PSEAE Oxaloacetate decarboxylase (PA4872) Y212F
Type:
Protein
Mol. Mass.:
31314.95
Organism:
Pseudomonas aeruginosa (strain ATCC 15692 / PAO1 / 1C / PRS 101 / LMG 12228)
Description:
Q9HUU1
Residue:
287
  
Inhibitor
Name:
BDBM92964
Synonyms:
CHEMBL182928 | Oxalate
Type:
Small molecule
Emp. Form.:
C2O4
Mol. Mass.:
88.0201
SMILES:
[O-]C(=O)C([O-])=O
: