Target
Protein kinase C alpha type
Ligand
BDBM92969
Substrate
Meas. Tech.
Mixed Micelle Assay
pH
7.5±0
Temperature
303.15±0 K
IC50
1.2e+4±n/a nM
Citation
 Bottega, REpand, RM Inhibition of protein kinase C by cationic amphiphiles. Biochemistry 31:9025-30 (1992)  
Target
Name:
Protein kinase C alpha type
Synonyms:
KPCA_RAT Prkca Protein kinase C alpha | Protein kinase C alpha type
Type:
Protein
Mol. Mass.:
76797.67
Organism:
Rattus norvegicus (Rat)
Description:
P05696
Residue:
672
  
Inhibitor
Name:
BDBM92969
Synonyms:
Amphiphile, IV
Type:
Small molecule
Emp. Form.:
C33H59N2O
Mol. Mass.:
499.8338
SMILES:
CC(C)CCCC(C)C1CCC2C3CC=C4CC(CCC4(C)C3CCC12C)C(=O)NCC[N+](C)(C)C
: