Target
Translocator protein
Ligand
BDBM279580
Substrate
Meas. Tech.
[3H]PK 11195 radio-assay
Ki
45.0±n/a nM
Citation
 Gavish, MVeenman, JAShterenberg, AMarek, IVainshtein, AAvital, A Quinazoline scaffold based compounds, pharmaceutical compositions and methods of use thereof US Patent  US10035780 Publication Date 7/31/2018 
Target
Name:
Translocator protein
Synonyms:
BZRP Mitochondrial benzodiazepine receptor PKBS Peripheral-type benzodiazepine receptor TSPO_HUMAN
Type:
Enzyme
Mol. Mass.:
18834.74
Organism:
Homo sapiens (Human)
Description:
P30536
Residue:
169
  
Inhibitor
Name:
BDBM279580
Synonyms:
US10035780, Compound 4
Type:
Small organic molecule
Emp. Form.:
C19H18BrN3O2
Mol. Mass.:
400.269
SMILES:
CCN(CC)C(=O)Oc1nc(nc2ccccc12)-c1ccc(Br)cc1
: