Target
Amine oxidase [flavin-containing] A
Ligand
BDBM92982
Substrate
Meas. Tech.
Inhibiton Assay
Ki
2.9e+4±n/a nM
Citation
 Krueger, MJEfange, SMMichelson, RHSinger, TP Interaction of flexible analogs of N-methyl-4-phenyl-1,2,3,6-tetrahydropyridine and of N-methyl-4-phenylpyridinium with highly purified monoamine oxidase A and B. Biochemistry 31:5611-5 (1992)  
Target
Name:
Amine oxidase [flavin-containing] A
Synonyms:
AOFA_HUMAN MAO-A Monoamine oxidase Monoamine oxidase type A (MAO A) Monoamine oxidase type A (MAOA)
Type:
Protein
Mol. Mass.:
59689.53
Organism:
Homo sapiens (Human)
Description:
P21397
Residue:
527
  
Inhibitor
Name:
BDBM92982
Synonyms:
MPP analogue, 18
Type:
Small molecule
Emp. Form.:
C13H13FN
Mol. Mass.:
202.2469
SMILES:
C[n+]1ccc(Cc2ccccc2F)cc1
: