Target
Farnesyl pyrophosphate synthase
Ligand
BDBM50059865
Substrate
Meas. Tech.
Transferase Assay
Ki
8.3e+2± 8e+1 nM
Citation
 Pompliano, DLRands, ESchaber, MDMosser, SDAnthony, NJGibbs, JB Steady-state kinetic mechanism of Ras farnesyl:protein transferase. Biochemistry 31:3800-7 (1992)  
Target
Name:
Farnesyl pyrophosphate synthase
Synonyms:
Dimethylallyltranstransferase FPP synthase FPPS_HUMAN Farnesyl diphosphate synthase Farnesyl diphosphate synthetase Farnesyl pyrophosphate synthetase KIAA1293 | P14324
Type:
Enzyme
Mol. Mass.:
48272.89
Organism:
Homo sapiens (Human)
Description:
P14324
Residue:
419
  
Inhibitor
Name:
BDBM50059865
Synonyms:
4,8,12-trimethyl-(3E,7E)-3,7,11-tridecatrienylhydroxyphosphorylmethylphosphonic acid anion Farnesyl PMP, 2 [Hydroxy-((3E,7E)-4,8,12-trimethyl-trideca-3,7,11-trienyl)-phosphinoylmethyl]-phosphonic acid [Hydroxy-(4,8,12-trimethyl-trideca-3,7,11-trienyl)-phosphinoylmethyl]-phosphonate
Type:
Small organic molecule
Emp. Form.:
C17H32O5P2
Mol. Mass.:
378.3805
SMILES:
[#6]-[#6](-[#6]-[#6]\[#6]=[#6](/[#6])-[#6]-[#6]\[#6]=[#6](/[#6])-[#6])-[#6]-[#6]=[#6]P([#8])(=O)[#6]P([#8])([#8])=O
: