Target
Bifunctional aspartokinase/homoserine dehydrogenase 1
Ligand
BDBM92987
Substrate
Meas. Tech.
Inhibition Assay
Ki
10000000±1000000 nM
Citation
 Angeles, TSHunsley, JRViola, RE Reversal of enzyme regiospecificity with alternative substrates for aspartokinase I from Escherichia coli. Biochemistry 31:799-805 (1992)  
Target
Name:
Bifunctional aspartokinase/homoserine dehydrogenase 1
Synonyms:
AK1H_ECOLI Bifunctional aspartokinase/homoserine dehydrogenase 1 thrA1 | thrA2
Type:
Protein
Mol. Mass.:
89109.15
Organism:
Escherichia coli
Description:
P00561
Residue:
820
  
Inhibitor
Name:
BDBM92987
Synonyms:
2,4-Diaminobutanoate
Type:
Small molecule
Emp. Form.:
C4H10N2O2
Mol. Mass.:
118.1344
SMILES:
NCC[C@H](N)C(O)=O
: