Target
Bifunctional aspartokinase/homoserine dehydrogenase 1
Ligand
BDBM92989
Substrate
Meas. Tech.
Inhibition Assay
Ki
16000000±6000000 nM
Citation
 Angeles, TSHunsley, JRViola, RE Reversal of enzyme regiospecificity with alternative substrates for aspartokinase I from Escherichia coli. Biochemistry 31:799-805 (1992)  
Target
Name:
Bifunctional aspartokinase/homoserine dehydrogenase 1
Synonyms:
AK1H_ECOLI Bifunctional aspartokinase/homoserine dehydrogenase 1 thrA1 | thrA2
Type:
Protein
Mol. Mass.:
89109.15
Organism:
Escherichia coli
Description:
P00561
Residue:
820
  
Inhibitor
Name:
BDBM92989
Synonyms:
D-aspartate-beta-hydroxamate
Type:
Small molecule
Emp. Form.:
C4H7N2O4
Mol. Mass.:
147.1099
SMILES:
N[C@@H](CC(=O)NO)C([O-])=O
: