Target
Bifunctional aspartokinase/homoserine dehydrogenase 1
Ligand
BDBM92995
Substrate
Meas. Tech.
Inhibition Assay
Ki
39000000±14000000 nM
Citation
 Angeles, TSHunsley, JRViola, RE Reversal of enzyme regiospecificity with alternative substrates for aspartokinase I from Escherichia coli. Biochemistry 31:799-805 (1992)  
Target
Name:
Bifunctional aspartokinase/homoserine dehydrogenase 1
Synonyms:
AK1H_ECOLI Bifunctional aspartokinase/homoserine dehydrogenase 1 thrA1 | thrA2
Type:
Protein
Mol. Mass.:
89109.15
Organism:
Escherichia coli
Description:
P00561
Residue:
820
  
Inhibitor
Name:
BDBM92995
Synonyms:
D-asparagine
Type:
Small molecule
Emp. Form.:
C4H7N2O3
Mol. Mass.:
131.1105
SMILES:
N[C@H](CC(N)=O)C([O-])=O
: