Target
3-oxoacyl-[acyl-carrier-protein] synthase 1
Ligand
BDBM50241313
Substrate
Meas. Tech.
Binding Fluorescence Titrations
pH
8.5±0
Ki
1.754e+5± 3.0e+3 nM
Citation
 Kapilashrami, KBommineni, GRMachutta, CAKim, PLai, CTSimmerling, CPicart, FTonge, PJ Thiolactomycin-based ß-Ketoacyl-AcpM Synthase A (KasA) Inhibitors: FRAGMENT-BASED INHIBITOR DISCOVERY USING TRANSIENT ONE-DIMENSIONAL NUCLEAR OVERHAUSER EFFECT NMR SPECTROSCOPY. J Biol Chem 288:6045-52 (2013)  
Target
Name:
3-oxoacyl-[acyl-carrier-protein] synthase 1
Synonyms:
Beta-ketoacyl-ACP synthase (KasA) C171Q kasA
Type:
Protein
Mol. Mass.:
43305.57
Organism:
Mycobacterium tuberculosis
Description:
P9WQD8
Residue:
416
  
Inhibitor
Name:
BDBM50241313
Synonyms:
(5R)-4-hydroxy-3,5-dimethyl-5-[(1E)-2-methylbuta-1,3-dienyl]thiophen-2(5H)-one (R)-4-Hydroxy-3,5-dimethyl-5-((E)-2-methyl-buta-1,3-dienyl)-5H-thiophen-2-one 5R-Thiolactomycin TLM analog, 1
Type:
Small organic molecule
Emp. Form.:
C11H14O2S
Mol. Mass.:
210.293
SMILES:
CC1C(=O)S[C@](C)(\C=C(/C)C=C)C1=O
: