Target
Hepatocyte growth factor receptor
Ligand
BDBM93142
Substrate
Meas. Tech.
Inhibition Assay
IC50
5e+1±n/a nM
Citation
 Raeppel, SLGaudette, FNguyen, HBeaulieu, NWang, JMaroun, CBesterman, JMVaisburg, A Identification of a Novel Series of Potent TrkA Receptor Tyrosine Kinase Inhibitors International Journal of Medicinal Chemistry 2012:1-6 (2012)   
Target
Name:
Hepatocyte growth factor receptor
Synonyms:
Hepatocyte growth factor receptor Hepatocyte growth factor receptor (c-MET) MET Met proto-oncogene (hepatocyte growth factor receptor) Tyrosine-protein kinase Met (c-Met) c-Met kinase
Type:
Protein
Mol. Mass.:
155559.73
Organism:
Homo sapiens (Human)
Description:
P08581
Residue:
1390
  
Inhibitor
Name:
BDBM93142
Synonyms:
Oxo-3-phenylimidazolidine-1-carboxamide, 3
Type:
Small molecule
Emp. Form.:
C25H24FN7O4
Mol. Mass.:
505.501
SMILES:
Fc1cc(NC(=O)N2CCN(C2=O)c2ccccc2)ccc1Oc1cc(NC(=O)N2CCCC2)ncn1
: