Target
Amyloid-beta precursor protein
Ligand
BDBM93329
Substrate
Meas. Tech.
Inhibition Assay
pH
7±0
Temperature
310.15±0 K
IC50
7.5±0.0 nM
Citation
 Vaccaro, HAZhao, ZClader, JWSong, LTerracina, GZhang, LPissarnitski, DA Solution-phase parallel synthesis of carbamates as gamma-secretase inhibitors. J Comb Chem 10:56-62 (2008)  
Target
Name:
Amyloid-beta precursor protein
Synonyms:
A4 ABPP AICD-50 AICD-59 AID(57) APP Alzheimer disease amyloid protein Amyloid beta Protein Amyloid beta protein Abeta(1-42) Amyloid intracellular domain 57 Amyloid protein (Abeta42b) Beta amyloid A4 protein Beta-APP42 Beta-amyloid protein 42 C83 CVAP Gamma Secretase Gamma-CTF(57) Gamma-secretase Gamma-secretase C-terminal fragment 57 P3(40) PN-II Protease nexin-II S-APP-beta Soluble APP-beta | beta-Amyloid Precursor Protein (APP)
Type:
Single-pass type I membrane protein
Mol. Mass.:
86890.41
Organism:
Homo sapiens (Human)
Description:
P05067
Residue:
770
  
Inhibitor
Name:
BDBM93329
Synonyms:
Carbamate {5,19}, 5
Type:
Small molecule
Emp. Form.:
C32H42F2N4O4S
Mol. Mass.:
616.762
SMILES:
Cc1ccc(cc1F)S(=O)(=O)CN1C(CCC[C@@H]1C1(CC1)OC(=O)NN1CCC(CC1)N1CCCC1)c1cccc(F)c1
: