Target
5-hydroxytryptamine receptor 6
Ligand
BDBM93367
Substrate
Meas. Tech.
Radioligand Binding Assay
IC50
527.9±0.0 nM
Citation
 Ivachtchenko, AVGolovina, ESKadieva, MGKoryakova, AGKovalenko, SMMitkin, ODOkun, IMRavnyeyko, IMTkachenko, SEZaremba, OV Solution phase parallel synthesis of substituted 3-phenylsulfonyl-[1,2,3]triazolo[1,5-a]quinazolines: selective serotonin 5-HT(6) receptor antagonists. J Comb Chem 12:445-52 (2010)  
Target
Name:
5-hydroxytryptamine receptor 6
Synonyms:
5-HT-6 5-hydroxytryptamine receptor 6 (5-HT-6) 5-hydroxytryptamine receptor 6 (5HT6) HTR6 Serotonin 6 (5-HT6) receptor | Serotonin Receptor 6
Type:
G Protein-Coupled Receptor (GPCR)
Mol. Mass.:
46968.43
Organism:
Homo sapiens (Human)
Description:
P50406
Residue:
440
  
Inhibitor
Name:
BDBM93367
Synonyms:
PSTQ Analog, 3{2,13}
Type:
Small molecule
Emp. Form.:
C23H18ClN5O2S
Mol. Mass.:
463.939
SMILES:
Cc1ccc(cc1)S(=O)(=O)c1nnn2c1nc(NCc1ccccc1Cl)c1ccccc21
: