Target
5-hydroxytryptamine receptor 6
Ligand
BDBM93380
Substrate
Meas. Tech.
Radioligand Binding Assay
IC50
703.7±0.0 nM
Citation
 Ivachtchenko, AVGolovina, ESKadieva, MGKoryakova, AGKovalenko, SMMitkin, ODOkun, IMRavnyeyko, IMTkachenko, SEZaremba, OV Solution phase parallel synthesis of substituted 3-phenylsulfonyl-[1,2,3]triazolo[1,5-a]quinazolines: selective serotonin 5-HT(6) receptor antagonists. J Comb Chem 12:445-52 (2010)  
Target
Name:
5-hydroxytryptamine receptor 6
Synonyms:
5-HT-6 5-hydroxytryptamine receptor 6 (5-HT-6) 5-hydroxytryptamine receptor 6 (5HT6) HTR6 Serotonin 6 (5-HT6) receptor | Serotonin Receptor 6
Type:
G Protein-Coupled Receptor (GPCR)
Mol. Mass.:
46968.43
Organism:
Homo sapiens (Human)
Description:
P50406
Residue:
440
  
Inhibitor
Name:
BDBM93380
Synonyms:
PSTQ Analog, 3{7,37}
Type:
Small molecule
Emp. Form.:
C23H18BrN5O2S
Mol. Mass.:
508.39
SMILES:
Cc1cccc(Nc2nc3c(nnn3c3ccccc23)S(=O)(=O)c2ccc(Br)cc2)c1C
: