Target
Egl nine homolog 1
Ligand
BDBM93419
Substrate
Meas. Tech.
PHD Enzymatic Assay
IC50
622±n/a nM
Citation
 Murray, JKBalan, CAllgeier, AMKasparian, AViswanadhan, VWilde, CAllen, JRYoder, SCBiddlecome, GHungate, RWMiranda, LP Dipeptidyl-quinolone derivatives inhibit hypoxia inducible factor-1a prolyl hydroxylases-1, -2, and -3 with altered selectivity. J Comb Chem 12:676-86 (2010)  
Target
Name:
Egl nine homolog 1
Synonyms:
C1orf12 EGLN1_HUMAN Hypoxia-inducible factor prolyl hydroxylase 2 (HIF-PH2) Prolyl hydroxylase domain-containing protein 2 (PHD2)
Type:
Protein
Mol. Mass.:
46035.59
Organism:
Homo sapiens (Human)
Description:
Q9GZT9
Residue:
426
  
Inhibitor
Name:
BDBM93419
Synonyms:
PHD Inhibitor, 12{2,4,1}
Type:
Small molecule
Emp. Form.:
C39H37N5O8
Mol. Mass.:
703.7398
SMILES:
Cn1c2ccc(CNC(=O)[C@@H](Cc3ccccc3)NC(=O)[C@@H](Cc3ccccc3)NC(=O)c3ccccc3)cc2c(O)c(C(=O)NCC(O)=O)c1=O
: