Target
Neuropilin-1
Ligand
BDBM94268
Substrate
IC50
>95000±n/a nM
Citation
 PubChem, PC Dose Response confirmation of small molecule modulators of the interaction between CendR and NRP-1 in a panel assay PubChem Bioassay (2012)[AID] 
Target
Name:
Neuropilin-1
Synonyms:
Chain A, Crystal Structure Of The B1b2 Domains From Human Neuropilin- 1 NRP1 Neuropilin-1 | VEGF165R
Type:
PROTEIN
Mol. Mass.:
103122.09
Organism:
Homo sapiens (Human)
Description:
ChEMBL_617636
Residue:
923
  
Inhibitor
Name:
BDBM94268
Synonyms:
(1S,3R,3aS,6aR)-3-ethyl-1-[[ethyl-(4-methoxyphenyl)sulfonyl-amino]methyl]-4,6-diketo-5-methyl-1,2,3a,6a-tetrahydropyrrolo[3,4-c]pyrrole-3-carboxylic acid methyl ester;2,2,2-trifluoroacetic acid MLS002477017 cid_44246811 methyl (1S,3R,3aS,6aR)-3-ethyl-1-[[ethyl-(4-methoxyphenyl)sulfonylamino]methyl]-5-methyl-4,6-dioxo-1,2,3a,6a-tetrahydropyrrolo[3,4-c]pyrrole-3-carboxylate;2,2,2-trifluoroacetic acid
Type:
Small organic molecule
Emp. Form.:
C21H29N3O7S
Mol. Mass.:
467.536
SMILES:
CCN(C[C@H]1N[C@](CC)([C@@H]2[C@H]1C(=O)N(C)C2=O)C(=O)OC)S(=O)(=O)c1ccc(OC)cc1
: