Target
Protein O-GlcNAcase
Ligand
BDBM50323697
Substrate
Meas. Tech.
Fluorescence-based hOGA
pH
7±n/a
Temperature
298.15±n/a K
Ki
0.40±n/a nM
Comments
extracted
Citation
 Kaul, RMcEachern, EJVocadlo, DJZhou, YDang, QSelnick, HG Glycosidase inhibitors and uses thereof US Patent  US9695197 Publication Date 7/4/2017 
Target
Name:
Protein O-GlcNAcase
Synonyms:
2-acetamido-2-deoxy-β-D-glucopyranosidase (O-GlcNAcase) Beta-hexosaminidase (O-GlcNAcase) HEXC MEA5 N-acetyl-beta-D-glucosaminidase (O-GlcNAcase) OGA Protein O-GlcNAcase
Type:
Enzyme
Mol. Mass.:
102874.67
Organism:
Homo sapiens (Human)
Description:
O60502
Residue:
916
  
Inhibitor
Name:
BDBM50323697
Synonyms:
(3AR,5R,6S,7R,7AR)-2-(ETHYLAMINO)-5-(HYDROXYMETHYL)-5,6,7,7A-TETRAHYDRO-3AH-PYRANO[3,2-D][1,3]THIAZOLE-6,7-DIOL US9243020, (3aR,5R,6S,7R,7aR)-2-(ethylamino)-5-(hydroxymethyl)-3aH,5H,6H,7H,7aH-pyrano[3,2-d][1,3]thiazole-6,7-diol US9815861, Example 098 | thiamet-G
Type:
Small organic molecule
Emp. Form.:
C9H16N2O4S
Mol. Mass.:
248.299
SMILES:
CCNC1=N[C@H]2[C@H](O[C@H](CO)[C@@H](O)[C@@H]2O)S1
: