Target
Tyrosine-protein kinase transforming protein Src
Ligand
BDBM4031
Substrate
poly(E,Y)
Meas. Tech.
Kinase Inhibition Assay
IC50
>100000±n/a nM
Citation
 Rewcastle, GWPalmer, BDDobrusin, EMFry, DWKraker, AJDenny, WA Tyrosine kinase inhibitors. 3. Structure-activity relationships for inhibition of protein tyrosine kinases by nuclear-substituted derivatives of 2,2'-dithiobis(1-methyl-N-phenyl-1H-indole-3-carboxamide). J Med Chem 37:2033-42 (1994)  
Target
Name:
Tyrosine-protein kinase transforming protein Src
Synonyms:
P60-Src V-SRC | pp60v-src
Type:
Enzyme
Mol. Mass.:
58884.32
Organism:
Avian sarcoma virus
Description:
P00525
Residue:
526
  
Inhibitor
Name:
BDBM4031
Synonyms:
6-chloro-2-{[6-chloro-1-methyl-3-(phenylcarbamoyl)-1H-indol-2-yl]disulfanyl}-1-methyl-N-phenyl-1H-indole-3-carboxamide | dithiobis(1H-indole-3-carboxamide) deriv. 10p
Type:
Small organic molecule
Emp. Form.:
C32H24Cl2N4O2S2
Mol. Mass.:
631.595
SMILES:
Cn1c(SSc2c(C(=O)Nc3ccccc3)c3ccc(Cl)cc3n2C)c(C(=O)Nc2ccccc2)c2ccc(Cl)cc12
:
Substrate
Name:
poly(E,Y)
Synonyms:
Type:
Random Polymer
Mol. Mass.:
358.43
Organism:
Description:
poly[(glu)4(tyr)l]. 5 uM ATP containing 0.2 uCi 32P labeled ATP as co-substrate.
Residue:
3
NA