Target
Low molecular weight phosphotyrosine protein phosphatase
Ligand
BDBM94896
Substrate
IC50
3140±n/a nM
Citation
 PubChem, PC Dose response confirmation of small molecule inhibitors of Low Molecular Weight Protein Tyrosine Phosphatase, LMPTP, via a fluorescence intensity assay PubChem Bioassay (2012)[AID] 
Target
Name:
Low molecular weight phosphotyrosine protein phosphatase
Synonyms:
3.1.3.2 ACP1 LMW-PTP LMWPTP PPAC_HUMAN low molecular weight phosphotyrosine protein phosphatase isoform c
Type:
Mol. Mass.:
18042.81
Organism:
Homo sapiens (Human)
Description:
P24666
Residue:
158
  
Inhibitor
Name:
BDBM94896
Synonyms:
3-(4-chlorophenyl)-N-methyl-5-triazolo[1,5-a]quinazolinamine 3-(4-chlorophenyl)-N-methyl[1,2,3]triazolo[1,5-a]quinazolin-5-amine MLS001199112 [3-(4-chlorophenyl)triazolo[1,5-a]quinazolin-5-yl]-methyl-amine | cid_6622721
Type:
Small organic molecule
Emp. Form.:
C16H12ClN5
Mol. Mass.:
309.753
SMILES:
CNc1nc2c(nnn2c2ccccc12)-c1ccc(Cl)cc1
: