Target
Low molecular weight phosphotyrosine protein phosphatase
Ligand
BDBM41069
Substrate
IC50
3810±n/a nM
Citation
 PubChem, PC Dose response confirmation of small molecule inhibitors of Low Molecular Weight Protein Tyrosine Phosphatase, LMPTP, via a fluorescence intensity assay PubChem Bioassay (2012)[AID] 
Target
Name:
Low molecular weight phosphotyrosine protein phosphatase
Synonyms:
3.1.3.2 ACP1 LMW-PTP LMWPTP PPAC_HUMAN low molecular weight phosphotyrosine protein phosphatase isoform c
Type:
Mol. Mass.:
18042.81
Organism:
Homo sapiens (Human)
Description:
P24666
Residue:
158
  
Inhibitor
Name:
BDBM41069
Synonyms:
3-Chloro-benzo[b]thiophene-2-carboxylic acid (3-oxazolo[4,5-b]pyridin-2-yl-phenyl)-amide 3-chloro-N-(3-oxazolo[4,5-b]pyridin-2-ylphenyl)benzothiophene-2-carboxamide 3-chloro-N-[3-([1,3]oxazolo[4,5-b]pyridin-2-yl)phenyl]-1-benzothiophene-2-carboxamide SMR000177639 | cid_1132506
Type:
Small organic molecule
Emp. Form.:
C21H12ClN3O2S
Mol. Mass.:
405.857
SMILES:
Clc1c(sc2ccccc12)C(=O)Nc1cccc(c1)-c1nc2ncccc2o1
: