Target
ADP-ribosylation factor GTPase-activating protein 1
Ligand
BDBM43011
Substrate
IC50
43155±n/a nM
Citation
 PubChem, PC Fluorescence polarization-based biochemical high throughput dose response screening assay to identify inhibitors of ADP-ribosylation factor GTPase activating protein 1 (ARFGAP1) PubChem Bioassay (2012)[AID] 
Target
Name:
ADP-ribosylation factor GTPase-activating protein 1
Synonyms:
ARFG1_RAT Arfgap1
Type:
Enzyme Catalytic Domain
Mol. Mass.:
45436.38
Organism:
Rattus norvegicus
Description:
gi_21489979
Residue:
415
  
Inhibitor
Name:
BDBM43011
Synonyms:
2-(6-Amino-3,5-dicyano-4-thiophen-2-yl-pyridin-2-ylsulfanyl)-N-(2-methoxy-benzyl)-acetamide 2-(6-azanyl-3,5-dicyano-4-thiophen-2-yl-pyridin-2-yl)sulfanyl-N-[(2-methoxyphenyl)methyl]ethanamide 2-[[6-amino-3,5-dicyano-4-(2-thienyl)-2-pyridyl]thio]-N-o-anisyl-acetamide SMR000147487 | cid_1941298
Type:
Small organic molecule
Emp. Form.:
C21H17N5O2S2
Mol. Mass.:
435.522
SMILES:
COc1ccccc1CNC(=O)CSc1nc(N)c(C#N)c(-c2cccs2)c1C#N
: