Target
ADP-ribosylation factor GTPase-activating protein 1
Ligand
BDBM94655
Substrate
IC50
10723±n/a nM
Citation
 PubChem, PC Fluorescence polarization-based biochemical high throughput dose response screening assay to identify inhibitors of ADP-ribosylation factor GTPase activating protein 1 (ARFGAP1) PubChem Bioassay (2012)[AID] 
Target
Name:
ADP-ribosylation factor GTPase-activating protein 1
Synonyms:
ARFG1_RAT Arfgap1
Type:
Enzyme Catalytic Domain
Mol. Mass.:
45436.38
Organism:
Rattus norvegicus
Description:
gi_21489979
Residue:
415
  
Inhibitor
Name:
BDBM94655
Synonyms:
2-[2-(2,6-dimethylmorpholin-4-yl)-2-oxidanylidene-ethyl]sulfanyl-7-methyl-pyrido[1,2-a][1,3,5]triazin-4-one 2-[[2-(2,6-dimethyl-4-morpholinyl)-2-oxoethyl]thio]-7-methyl-4-pyrido[1,2-a][1,3,5]triazinone MLS001234975 cid_18573499
Type:
Small organic molecule
Emp. Form.:
C16H20N4O3S
Mol. Mass.:
348.42
SMILES:
CC1CN(CC(C)O1)C(=O)CSc1nc2ccc(C)cn2c(=O)n1
: