Target
Envelope glycoprotein gp160
Ligand
BDBM95252
Substrate
IC50
17507±n/a nM
Citation
 PubChem, PC Counterscreen for discovery of small molecules that bind to the HIV-1-gp120 binding antibody, PG9 PubChem Bioassay (2012)[AID] 
Target
Name:
Envelope glycoprotein gp160
Synonyms:
ENV_HV1H2 Envelope surface glycoprotein gp160, precursor env
Type:
Mol. Mass.:
97241.93
Organism:
Human immunodeficiency virus type 1 group M subtype B (isolate HXB2)
Description:
Residue:
856
  
Inhibitor
Name:
BDBM95252
Synonyms:
MLS000529842 N-[2-(2-methylindol-1-yl)ethyl]cyclohexanecarboxamide cid_3641859
Type:
Small organic molecule
Emp. Form.:
C18H24N2O
Mol. Mass.:
284.396
SMILES:
Cc1cc2ccccc2n1CCNC(=O)C1CCCCC1
: