Target
Low molecular weight phosphotyrosine protein phosphatase
Ligand
BDBM94979
Substrate
IC50
4510±n/a nM
Citation
 PubChem, PC Dose response confirmation of small molecule inhibitors of Low Molecular Weight Protein Tyrosine Phosphatase, LMPTP, in an orthogonal absorbance-based assay PubChem Bioassay (2013)[AID] 
Target
Name:
Low molecular weight phosphotyrosine protein phosphatase
Synonyms:
3.1.3.2 ACP1 LMW-PTP LMWPTP PPAC_HUMAN low molecular weight phosphotyrosine protein phosphatase isoform c
Type:
Mol. Mass.:
18042.81
Organism:
Homo sapiens (Human)
Description:
P24666
Residue:
158
  
Inhibitor
Name:
BDBM94979
Synonyms:
2-thiophenecarboxylic acid [4-[(Z)-[[(4-chlorophenyl)-oxomethyl]hydrazinylidene]methyl]phenyl] ester SMR000176672 [4-[(Z)-[(4-chlorobenzoyl)hydrazinylidene]methyl]phenyl] thiophene-2-carboxylate cid_5789896 | thiophene-2-carboxylic acid [4-[(Z)-[(4-chlorobenzoyl)hydrazono]methyl]phenyl] ester
Type:
Small organic molecule
Emp. Form.:
C19H13ClN2O3S
Mol. Mass.:
384.836
SMILES:
Clc1ccc(cc1)C(=O)N\N=C/c1ccc(OC(=O)c2cccs2)cc1
: