Target
Low molecular weight phosphotyrosine protein phosphatase
Ligand
BDBM73701
Substrate
IC50
11900±n/a nM
Citation
 PubChem, PC Dose response confirmation of small molecule inhibitors of Low Molecular Weight Protein Tyrosine Phosphatase, LMPTP, in an orthogonal absorbance-based assay PubChem Bioassay (2013)[AID] 
Target
Name:
Low molecular weight phosphotyrosine protein phosphatase
Synonyms:
3.1.3.2 ACP1 LMW-PTP LMWPTP PPAC_HUMAN low molecular weight phosphotyrosine protein phosphatase isoform c
Type:
Mol. Mass.:
18042.81
Organism:
Homo sapiens (Human)
Description:
P24666
Residue:
158
  
Inhibitor
Name:
BDBM73701
Synonyms:
2,6-diamino-5-(2,4-dichlorobenzyl)-4-pyrimidinylamine MLS000691890 [2,6-diamino-5-(2,4-dichlorobenzyl)pyrimidin-4-yl]amine | cid_3522147
Type:
Small organic molecule
Emp. Form.:
C11H11Cl2N5
Mol. Mass.:
284.145
SMILES:
Nc1nc(N)c(Cc2ccc(Cl)cc2Cl)c(N)n1
: