Target
Low molecular weight phosphotyrosine protein phosphatase
Ligand
BDBM95053
Substrate
IC50
10400±n/a nM
Citation
 PubChem, PC Dose response confirmation of small molecule inhibitors of Low Molecular Weight Protein Tyrosine Phosphatase, LMPTP, in an orthogonal absorbance-based assay PubChem Bioassay (2013)[AID] 
Target
Name:
Low molecular weight phosphotyrosine protein phosphatase
Synonyms:
3.1.3.2 ACP1 LMW-PTP LMWPTP PPAC_HUMAN low molecular weight phosphotyrosine protein phosphatase isoform c
Type:
Mol. Mass.:
18042.81
Organism:
Homo sapiens (Human)
Description:
P24666
Residue:
158
  
Inhibitor
Name:
BDBM95053
Synonyms:
3,4-bis(3-methoxyanilino)cyclobut-3-ene-1,2-dione 3,4-bis[(3-methoxyphenyl)amino]cyclobut-3-ene-1,2-dione SMR000567814 | cid_2824412
Type:
Small organic molecule
Emp. Form.:
C18H16N2O4
Mol. Mass.:
324.3306
SMILES:
COc1cccc(Nc2c(Nc3cccc(OC)c3)c(=O)c2=O)c1
: