Target
Botulinum neurotoxin type A
Ligand
BDBM1715
Substrate
EC50
600±n/a nM
Citation
 PubChem, PC Confirmatory FRET assay using full length substrates for Botulinum neurotoxin light chain A protease, with Powder Set01 PubChem Bioassay (2013)[AID] 
Target
Name:
Botulinum neurotoxin type A
Synonyms:
BXA1_CLOBH bna | botA
Type:
PROTEIN
Mol. Mass.:
149421.96
Organism:
Clostridium botulinum (strain Hall / ATCC 3502 / NCTC 13319 / Type A)
Description:
ChEMBL_987932
Residue:
1296
  
Inhibitor
Name:
BDBM1715
Synonyms:
cid_1299052
Type:
Emp. Form.:
C20H16N4OS2
Mol. Mass.:
392.497
SMILES:
O=C(NC1CC1)Nc1ccc2nc(-c3cccs3)c(nc2c1)-c1cccs1
: