Target
Huntingtin
Ligand
BDBM44107
Substrate
IC50
5439±n/a nM
Citation
 PubChem, PC Fluorescence-based biochemical high throughput dose response assay to identify molecules that bind r(CAG) RNA repeats PubChem Bioassay (2013)[AID] 
Target
Name:
Huntingtin
Synonyms:
HD HD_HUMAN Homo sapiens huntingtin (HTT), mRNA Huntington disease protein | IT15
Type:
PROTEIN
Mol. Mass.:
347579.69
Organism:
Homo sapiens (Human)
Description:
EBI_101216
Residue:
3142
  
Inhibitor
Name:
BDBM44107
Synonyms:
2-[(5Z)-4-keto-5-[(E)-2-methyl-3-phenyl-prop-2-enylidene]-2-thioxo-thiazolidin-3-yl]-3-methyl-butyric acid 3-methyl-2-[(5Z)-5-[(E)-2-methyl-3-phenylprop-2-enylidene]-4-oxo-2-sulfanylidene-1,3-thiazolidin-3-yl]butanoic acid MLS000713304 cid_5342554
Type:
Small organic molecule
Emp. Form.:
C18H19NO3S2
Mol. Mass.:
361.478
SMILES:
CC(C)C(N1C(=S)S\C(=C/C(/C)=C/c2ccccc2)C1=O)C(O)=O
: