Target
Huntingtin
Ligand
BDBM96503
Substrate
IC50
1866±n/a nM
Citation
 PubChem, PC Fluorescence-based biochemical high throughput dose response assay to identify molecules that bind r(CAG) RNA repeats PubChem Bioassay (2013)[AID] 
Target
Name:
Huntingtin
Synonyms:
HD HD_HUMAN Homo sapiens huntingtin (HTT), mRNA Huntington disease protein | IT15
Type:
PROTEIN
Mol. Mass.:
347579.69
Organism:
Homo sapiens (Human)
Description:
EBI_101216
Residue:
3142
  
Inhibitor
Name:
BDBM96503
Synonyms:
2-[[4-[2-(4-methoxyphenoxy)ethanoylamino]phenyl]carbonylamino]benzoic acid 2-[[[4-[[2-(4-methoxyphenoxy)-1-oxoethyl]amino]phenyl]-oxomethyl]amino]benzoic acid SMR000646743 | cid_1980401
Type:
Small organic molecule
Emp. Form.:
C23H20N2O6
Mol. Mass.:
420.4147
SMILES:
COc1ccc(OCC(=O)Nc2ccc(cc2)C(=O)Nc2ccccc2C(O)=O)cc1
: