Target
Huntingtin
Ligand
BDBM58741
Substrate
IC50
635.71±n/a nM
Citation
 PubChem, PC Fluorescence-based biochemical high throughput dose response assay to identify molecules that bind r(CAG) RNA repeats PubChem Bioassay (2013)[AID] 
Target
Name:
Huntingtin
Synonyms:
HD HD_HUMAN Homo sapiens huntingtin (HTT), mRNA Huntington disease protein | IT15
Type:
PROTEIN
Mol. Mass.:
347579.69
Organism:
Homo sapiens (Human)
Description:
EBI_101216
Residue:
3142
  
Inhibitor
Name:
BDBM58741
Synonyms:
2-[3-hydroxy-2-keto-4-(5-methyl-2-furoyl)-5-(4-nitrophenyl)-3-pyrrolin-1-yl]-4-methyl-thiazole-5-carboxylic acid methyl ester MLS001035378 cid_2918794 methyl 4-methyl-2-[3-(5-methylfuran-2-yl)carbonyl-2-(4-nitrophenyl)-4-oxidanyl-5-oxidanylidene-2H-pyrrol-1-yl]-1,3-thiazole-5-carboxylate
Type:
Small organic molecule
Emp. Form.:
C22H17N3O8S
Mol. Mass.:
483.451
SMILES:
COC(=O)c1sc(nc1C)N1C(C(C(=O)c2ccc(C)o2)C(=O)C1=O)c1ccc(cc1)[N+]([O-])=O
: