Target
Huntingtin
Ligand
BDBM53725
Substrate
IC50
848.03±n/a nM
Citation
 PubChem, PC Fluorescence-based biochemical high throughput dose response assay to identify molecules that bind r(CAG) RNA repeats PubChem Bioassay (2013)[AID] 
Target
Name:
Huntingtin
Synonyms:
HD HD_HUMAN Homo sapiens huntingtin (HTT), mRNA Huntington disease protein | IT15
Type:
PROTEIN
Mol. Mass.:
347579.69
Organism:
Homo sapiens (Human)
Description:
EBI_101216
Residue:
3142
  
Inhibitor
Name:
BDBM53725
Synonyms:
MLS000035506 N-[(5Z)-5-[(4,5-dimethoxy-2-nitro-phenyl)methylidene]-4-oxidanylidene-1,3-thiazol-2-yl]benzenesulfonamide N-[(5Z)-5-[(4,5-dimethoxy-2-nitrophenyl)methylidene]-4-oxo-2-thiazolyl]benzenesulfonamide SMR000123103 | cid_1912687
Type:
Small organic molecule
Emp. Form.:
C18H15N3O7S2
Mol. Mass.:
449.458
SMILES:
COc1cc(\C=C2/SC(NS(=O)(=O)c3ccccc3)=NC2=O)c(cc1OC)[N+]([O-])=O
: