Target
Guanine nucleotide-binding protein subunit alpha-15
Ligand
BDBM96916
Substrate
IC50
10023±n/a nM
Citation
 PubChem, PC Counterscreen for antagonists of the human trace amine associated receptor 1 (hTAAR1): Fluorescence-based cell-based high throughput dose response assay to identify nonselective Ga16 antagonists PubChem Bioassay (2013)[AID] 
Target
Name:
Guanine nucleotide-binding protein subunit alpha-15
Synonyms:
G-protein subunit alpha-16 GNA15 GNA16 | guanine nucleotide-binding protein subunit alpha-15
Type:
Protein
Mol. Mass.:
43577.62
Organism:
Homo sapiens (Human)
Description:
P30679
Residue:
374
  
Inhibitor
Name:
BDBM96916
Synonyms:
MLS001000420 N-benzhydryl-3-(2-ethoxyethoxy)benzamide cid_2982577
Type:
Small organic molecule
Emp. Form.:
C24H25NO3
Mol. Mass.:
375.4602
SMILES:
CCOCCOc1cccc(c1)C(=O)NC(c1ccccc1)c1ccccc1
: