Target
Guanine nucleotide-binding protein subunit alpha-15
Ligand
BDBM96618
Substrate
IC50
28735±n/a nM
Citation
 PubChem, PC Counterscreen for agonists of the human trace amine associated receptor 1 (TAAR1): Fluorescence-based cell-based high throughput dose response assay to identify nonselective Ga16 antagonists PubChem Bioassay (2013)[AID] 
Target
Name:
Guanine nucleotide-binding protein subunit alpha-15
Synonyms:
G-protein subunit alpha-16 GNA15 GNA16 | guanine nucleotide-binding protein subunit alpha-15
Type:
Protein
Mol. Mass.:
43577.62
Organism:
Homo sapiens (Human)
Description:
P30679
Residue:
374
  
Inhibitor
Name:
BDBM96618
Synonyms:
MLS000537230 N-[[4-[(6-chloro-3-pyridinyl)methoxy]-3-methoxyphenyl]methyl]-2-(2-fluorophenyl)ethanamine;hydrochloride N-{4-[(6-chloro-3-pyridinyl)methoxy]-3-methoxybenzyl}-N-[2-(2-fluorophenyl)ethyl]amine [4-[(6-chloro-3-pyridyl)methoxy]-3-methoxy-benzyl]-[2-(2-fluorophenyl)ethyl]amine;hydrochloride | cid_11948806
Type:
Small organic molecule
Emp. Form.:
C22H22ClFN2O2
Mol. Mass.:
400.874
SMILES:
COc1cc(CNCCc2ccccc2F)ccc1OCc1ccc(Cl)nc1
: