Target
Guanine nucleotide-binding protein subunit alpha-15
Ligand
BDBM76182
Substrate
IC50
23500±n/a nM
Citation
 PubChem, PC Counterscreen for agonists of the human trace amine associated receptor 1 (TAAR1): Fluorescence-based cell-based high throughput dose response assay to identify nonselective Ga16 antagonists PubChem Bioassay (2013)[AID] 
Target
Name:
Guanine nucleotide-binding protein subunit alpha-15
Synonyms:
G-protein subunit alpha-16 GNA15 GNA16 | guanine nucleotide-binding protein subunit alpha-15
Type:
Protein
Mol. Mass.:
43577.62
Organism:
Homo sapiens (Human)
Description:
P30679
Residue:
374
  
Inhibitor
Name:
BDBM76182
Synonyms:
1-(2-nitrophenyl)-3-[[(Z)-(3-oxidanyl-4-oxidanylidene-cyclohexa-2,5-dien-1-ylidene)methyl]amino]thiourea 1-[[(Z)-(3-hydroxy-4-oxo-1-cyclohexa-2,5-dienylidene)methyl]amino]-3-(2-nitrophenyl)thiourea MLS000417596 cid_16189676
Type:
Small organic molecule
Emp. Form.:
C14H12N4O4S
Mol. Mass.:
332.334
SMILES:
Oc1c[c-](C=[NH+]NC(=S)Nc2ccccc2[N+]([O-])=O)ccc1=O
: