Target
Guanine nucleotide-binding protein subunit alpha-15
Ligand
BDBM96779
Substrate
IC50
19973±n/a nM
Citation
 PubChem, PC Counterscreen for agonists of the human trace amine associated receptor 1 (TAAR1): Fluorescence-based cell-based high throughput dose response assay to identify nonselective Ga16 antagonists PubChem Bioassay (2013)[AID] 
Target
Name:
Guanine nucleotide-binding protein subunit alpha-15
Synonyms:
G-protein subunit alpha-16 GNA15 GNA16 | guanine nucleotide-binding protein subunit alpha-15
Type:
Protein
Mol. Mass.:
43577.62
Organism:
Homo sapiens (Human)
Description:
P30679
Residue:
374
  
Inhibitor
Name:
BDBM96779
Synonyms:
5-[(2-ethylphenyl)sulfonylmethyl]-N-(2-phenylethyl)-2-furancarboxamide 5-[(2-ethylphenyl)sulfonylmethyl]-N-phenethyl-2-furamide SMR000623131 | cid_6619424
Type:
Small organic molecule
Emp. Form.:
C22H23NO4S
Mol. Mass.:
397.487
SMILES:
CCc1ccccc1S(=O)(=O)Cc1ccc(o1)C(=O)NCCc1ccccc1
: